{"text_format":"3","workbook":"xlsx","n_sheets":12,"sheets":["Instructions","Project Information","Report","Rural 2-Lane Site Total","Multi-Year Summary","Multi-Year Analysis Report","Multi-Year Template","Segment Template","Intersection Template","Segment Tables","Intersection Tables","Construction - Do Not Delete"],"not_rendered":{"charts":3,"images":2,"macros":1,"defined_names":34},"read":"whole","date_system":"1900"}

{"sheet":"Instructions","index":0,"n_rows":40,"n_cols":4,"rows_kept":40,"merged":[[1,2,1,14],[4,2,4,14],[19,2,19,14],[23,2,23,14],[24,2,24,14],[25,2,25,14],[26,2,26,14],[27,2,27,14],[28,2,28,14],[29,2,29,14],[30,2,30,14],[31,2,31,14],[32,2,32,14],[35,2,35,14],[36,2,36,14],[37,2,37,14],[38,2,38,14],[39,2,39,14]]}
[]
[null,null,"HSM Part C Training Tool Instructions"]
[]
[null,null,"Overview"]
[null,null,"This series of spreadsheets has been developed to assist in the application of the predictive methods contained in the Highway Safety Manual (HSM), 1st Edition for analyzing: urban and suburban arterials, rural multilane roads, and rural two lane roads.  "]
[]
[null,null,"Data Color Guidelines"]
[]
{"$rows_left_out":33}
{"sheet":"Project Information","index":1,"n_rows":30,"n_cols":38,"rows_kept":30,"merged":[[0,0,0,7],[0,10,0,21],[1,0,1,7],[2,1,2,2],[3,1,3,2],[4,1,4,2],[5,1,5,2],[6,1,6,2],[10,1,10,2],[11,1,11,2],[12,0,12,3],[12,4,15,4],[12,5,12,7],[13,0,15,0],[13,1,13,2],[13,3,15,3],[13,6,13,7],[14,1,15,1],[14,2,15,2],[14,5,15,5],[14,6,15,6],[14,7,15,7],[16,0,16,7],[18,0,18,7]]}
["PROJECT SAFETY PERFORMANCE ANALYSIS INPUT SHEET - RURAL 2-LANE ROADS",{"$nulls":9},"User Work Space"]
["General Information"]
["Project Name","Practical Case Study",null,"Contact Email",null,"email"]
["Project Description","Three Signalized Intersections",null,"Contact Phone",null,1234567891]
["Reference Number","STARS Report A-1",null,"Date Performed",null,"2011-05-12"]
["Analyst","John Smith",null,"Analysis Year",null,2011]
["Agency/Company","ABC Company",null,"Multiple Year Analysis?"]
[]
{"$rows_left_out":15}
{"sheet":"Report","index":2,"n_rows":35,"n_cols":48,"rows_kept":35,"merged":[[0,0,0,9],[0,13,0,23],[1,0,1,9],[2,1,2,9],[3,1,3,9],[4,1,4,9],[5,1,5,9],[6,1,6,9],[7,1,7,9],[8,1,8,9],[9,1,9,9],[10,0,10,9],[11,1,11,3],[11,4,11,6],[11,7,11,9],[12,0,14,0],[12,1,12,3],[12,4,12,6],[12,7,12,9],[13,3,14,3],[13,6,14,6],[13,9,14,9],[21,0,22,9],[23,0,24,3],[23,4,23,5],[23,6,23,7],[23,8,23,9],[24,4,24,5],[24,6,24,7],[24,8,24,9],[25,0,25,3],[25,4,25,5],[25,6,25,7],[25,8,25,9],[26,0,26,3],[26,4,26,5],[26,6,26,7],[26,8,26,9],[27,0,27,3],[27,4,27,5],[27,6,27,7],[27,8,27,9],[29,47,29,56],[30,47,30,49],[32,0,32,9],[33,0,33,9],[34,0,34,9],[35,0,35,9]]}
["PROJECT SAFETY PERFORMANCE SUMMARY REPORT",{"$nulls":12},"User Work Space"]
["General Information"]
["Project Name",{"$f":"'Project Information'!B3","v":"Practical Case Study"}]
["Project Description",{"$f":"'Project Information'!B4","v":"Three Signalized Intersections"}]
["Reference Number",{"$f":"'Project Information'!B5","v":"STARS Report A-1"}]
["Analyst",{"$f":"'Project Information'!B6","v":"John Smith"}]
["Agency/Company",{"$f":"'Project Information'!B7","v":"ABC Company"}]
["Contact Email",{"$f":"'Project Information'!F3","v":"email"}]
{"$rows_left_out":28}
{"sheet":"Rural 2-Lane Site Total","index":3,"n_rows":29,"n_cols":15,"rows_kept":29,"hidden":true,"merged":[[2,1,3,11],[2,14,2,24],[4,1,4,2],[5,1,10,2],[5,3,7,5],[5,6,7,8],[5,9,10,9],[5,10,7,10],[5,11,7,11],[8,3,10,3],[8,4,10,4],[8,5,10,5],[8,6,10,6],[8,7,10,7],[8,8,10,8],[8,10,10,10],[8,11,10,11],[15,1,15,2],[19,2,20,10],[21,2,21,4],[21,5,21,7],[21,8,21,10],[22,2,22,4],[22,5,22,7],[22,8,22,10],[23,2,24,4],[23,5,23,7],[23,8,23,10],[24,5,24,7],[24,8,24,10],[25,2,26,4],[25,5,25,7],[25,8,25,10],[26,5,26,7],[26,8,26,10],[27,2,28,4],[27,5,27,7],[27,8,27,10],[28,5,28,7],[28,8,28,10],[29,47,31,47]]}
[]
[]
[null,"Worksheet 3A -- Predicted and Observed Crashes by Severity and Site Type Using the Site-Specific EB Method",{"$nulls":12},"User Work Space"]
[]
[null,"(1)",null,"(2)","(3)","(4)","(5)","(5)","(5)","(6)","(7)","(8)"]
[null,"Site type",null,"Predicted average crash frequency (crashes/year)",null,null,"Observed crashes,   Nobserved (crashes/year)",null,null,"Overdispersion Parameter, k","Weighted adjustment, w","Expected average crash frequency, Nexpected"]
[]
[]
{"$rows_left_out":22}
{"sheet":"Multi-Year Summary","index":4,"n_rows":12,"n_cols":10,"rows_kept":12,"hidden":true,"merged":[[3,0,3,3],[4,0,4,1],[4,2,4,3],[5,0,5,1],[5,2,5,3],[6,0,6,1],[6,2,6,3],[10,0,11,0],[10,1,10,3],[10,4,10,6],[10,7,10,9]]}
["MULTIPLE-YEAR ANALYSIS SUMMARY FOR RURAL 2-LANE ROADS"]
[]
[]
["General Information"]
["Base Year"]
["Analysis Period (Years)"]
["Linear Traffic Growth Rate (annual %)"]
[]
{"$rows_left_out":5}
{"sheet":"Multi-Year Analysis Report","index":5,"n_rows":35,"n_cols":13,"rows_kept":35,"hidden":true,"merged":[[0,0,0,9],[0,12,0,22],[1,0,1,9],[2,1,2,9],[3,1,3,9],[4,1,4,9],[5,1,5,9],[6,1,6,9],[7,1,7,9],[8,1,8,9],[9,1,9,9],[10,1,10,9],[11,1,11,9],[12,1,12,9],[13,0,13,9],[15,0,15,9],[16,0,17,0],[16,1,16,3],[16,4,16,6],[16,7,16,9],[23,4,23,5],[23,6,23,7],[23,8,23,9],[24,4,24,5],[24,6,24,7],[24,8,24,9],[25,0,25,3],[25,4,25,5],[25,6,25,7],[25,8,25,9],[26,0,26,3],[26,4,26,5],[26,6,26,7],[26,8,26,9],[27,0,27,3],[27,4,27,5],[27,6,27,7],[27,8,27,9],[31,0,31,8],[32,0,32,8],[33,0,33,8],[34,0,34,8]]}
["MULTIPLE YEAR PROJECT SAFETY PERFORMANCE SUMMARY REPORT FOR RURAL 2-LANE ROADS",{"$nulls":11},"User Work Space"]
["General Information"]
["Project Name",{"$f":"'Project Information'!B3","v":"Practical Case Study"}]
["Project Description",{"$f":"'Project Information'!B4","v":"Three Signalized Intersections"}]
["Reference Number",{"$f":"'Project Information'!B5","v":"STARS Report A-1"}]
["Analyst",{"$f":"'Project Information'!B6","v":"John Smith"}]
["Agency/Company",{"$f":"'Project Information'!B7","v":"ABC Company"}]
["Contact Email",{"$f":"'Project Information'!F3","v":"email"}]
{"$rows_left_out":28}
{"sheet":"Multi-Year Template","index":6,"n_rows":13,"n_cols":13,"rows_kept":13,"hidden":true,"merged":[[0,0,1,9],[0,12,0,22],[2,0,2,9],[3,0,3,1],[3,2,3,4],[3,5,3,6],[3,7,3,9],[4,0,4,1],[4,2,4,4],[4,5,4,6],[4,7,4,9],[5,0,5,1],[5,2,5,4],[5,5,5,6],[5,7,5,9],[6,0,6,1],[6,2,6,4],[6,5,6,6],[6,7,6,9],[7,0,7,1],[9,0,9,4],[10,0,10,1],[10,2,10,4],[11,0,11,1],[11,2,11,4],[12,0,12,1],[12,2,12,4]]}
["MULTIPLE-YEAR ANALYSIS FOR RURAL 2-LANE ROADS - INPUTS",{"$nulls":11},"User Work Space"]
[]
["General Information"]
["Project Name",null,{"$f":"'Project Information'!B3","v":"Practical Case Study"},null,null,"Analyst",null,{"$f":"'Project Information'!B6","v":"John Smith"}]
["Project Description",null,{"$f":"'Project Information'!B4","v":"Three Signalized Intersections"},null,null,"Contact Email",null,{"$f":"'Project Information'!F3","v":"email"}]
["Reference Number",null,{"$f":"'Project Information'!B5","v":"STARS Report A-1"},null,null,"Contact Phone",null,{"$f":"'Project Information'!F4","v":1234567891}]
["Agency/Company",null,{"$f":"'Project Information'!B7","v":"ABC Company"},null,null,"Date Performed",null,{"$f":"'Project Information'!F5","v":"2011-05-12"}]
[]
{"$rows_left_out":6}
{"sheet":"Segment Template","index":7,"n_rows":102,"n_cols":48,"rows_kept":102,"hidden":true,"merged":[[0,0,1,12],[0,15,0,20],[2,0,2,5],[2,6,2,12],[3,0,3,1],[3,2,3,5],[3,6,3,8],[3,9,3,12],[4,0,4,1],[4,2,4,5],[4,6,4,8],[4,9,4,12],[4,37,5,41],[5,0,5,1],[5,2,5,5],[5,6,5,8],[5,9,5,12],[6,0,6,1],[6,2,6,5],[6,6,6,8],[6,9,6,12],[6,37,7,38],[6,39,6,41],[7,0,7,5],[7,6,7,9],[7,10,7,12],[8,0,8,5],[8,6,8,9],[8,10,8,12],[8,37,8,38],[9,0,9,2],[9,6,9,9],[9,10,9,12],[9,37,9,38],[10,0,10,5],[10,6,10,9],[10,10,10,12],[10,37,10,38],[11,0,11,5],[11,10,11,12],[11,37,11,38],[12,0,12,5],[12,10,12,12],[12,37,12,38],[13,0,13,5],[13,6,13,9],[13,10,13,12],[13,37,13,38],[14,0,14,5],[14,6,14,9],[14,10,14,12],[14,37,14,38],[15,0,15,5],[15,6,15,9],[15,10,15,12],[15,37,18,41],[16,0,16,5],[16,6,16,9],[16,10,16,12],[17,0,17,5],[17,6,17,9],[17,10,17,12],[18,0,18,5],[18,6,18,9],[18,10,18,12],[19,0,19,5],[19,6,19,9],[19,10,19,12],[20,0,20,5],[20,6,20,9],[20,10,20,12],[20,37,21,41],[21,0,21,5],[21,6,21,9],[21,10,21,12],[22,0,22,5],[22,6,22,9],[22,10,22,12],[22,37,23,38],[22,39,22,41],[23,0,23,5],[23,6,23,9],[23,10,23,12],[24,0,24,5],[24,6,24,9],[24,10,24,12],[24,37,24,38],[25,0,25,5],[25,6,25,9],[25,10,25,12],[25,37,25,38],[26,0,26,9],[26,37,26,38],[27,0,28,4],[27,6,27,7],[27,8,27,9],[27,13,31,13],[27,37,27,38],[28,6,28,7],[28,8,28,9],[28,37,28,38],[29,37,29,38],[30,37,30,38],[31,37,31,38],[32,37,32,38],[33,0,33,12],[33,37,36,41],[35,0,38,0],[35,1,38,1],[35,2,38,2],[35,3,38,3],[35,4,38,4],[35,5,38,5],[35,6,38,6],[35,7,38,7],[35,8,38,8],[35,9,38,9],[35,10,38,10],[35,11,38,11],[35,12,38,12],[40,0,43,0],[40,1,43,1],[40,2,43,2],[40,3,43,3],[40,4,43,4],[40,5,43,5],[40,6,43,6],[40,7,43,7],[40,8,43,8],[40,9,43,9],[40,10,43,10],[40,11,43,11],[40,12,43,12],[48,0,48,12],[49,0,49,1],[49,3,49,4],[49,5,49,6],[49,7,49,8],[49,11,49,12],[50,0,51,1],[50,3,50,4],[50,5,50,6],[50,7,50,8],[50,11,50,12],[51,3,51,4],[51,5,51,6],[51,7,51,8],[51,11,51,12],[52,0,52,1],[52,3,52,4],[52,5,52,6],[52,7,52,8],[52,11,52,12],[53,0,53,1],[53,3,53,4],[53,5,53,6],[53,7,53,8],[53,11,53,12],[54,0,54,1],[54,3,54,4],[54,5,54,6],[54,7,54,8],[54,11,54,12],[58,0,58,12],[59,0,59,1],[59,3,59,4],[59,5,59,6],[59,7,59,8],[59,9,59,10],[59,11,59,12],[60,0,61,1],[60,3,60,4],[60,5,60,6],[60,7,60,8],[60,9,60,10],[60,11,60,12],[61,3,61,4],[61,5,61,6],[61,7,61,8],[61,9,61,10],[61,11,61,12],[62,0,62,1],[62,3,62,4],[62,5,62,6],[62,7,62,8],[62,9,62,10],[62,11,62,12],[63,0,63,1],[63,3,63,4],[63,5,63,6],[63,7,63,8],[63,9,63,10],[63,11,63,12],[64,0,64,12],[65,0,65,1],[65,3,65,4],[65,5,65,6],[65,7,65,8],[65,9,65,10],[65,11,65,12],[66,0,66,1],[66,3,66,4],[66,5,66,6],[66,7,66,8],[66,9,66,10],[66,11,66,12],[67,0,67,1],[67,3,67,4],[67,5,67,6],[67,7,67,8],[67,9,67,10],[67,11,67,12],[68,0,68,1],[68,3,68,4],[68,5,68,6],[68,7,68,8],[68,9,68,10],[68,11,68,12],[69,0,69,1],[69,3,69,4],[69,5,69,6],[69,7,69,8],[69,9,69,10],[69,11,69,12],[70,0,70,1],[70,3,70,4],[70,5,70,6],[70,7,70,8],[70,9,70,10],[70,11,70,12],[71,0,71,1],[71,3,71,4],[71,5,71,6],[71,7,71,8],[71,9,71,10],[71,11,71,12],[72,0,72,12],[73,0,73,1],[73,3,73,4],[73,5,73,6],[73,7,73,8],[73,9,73,10],[73,11,73,12],[74,0,74,1],[74,3,74,4],[74,5,74,6],[74,7,74,8],[74,9,74,10],[74,11,74,12],[75,0,75,1],[75,3,75,4],[75,5,75,6],[75,7,75,8],[75,9,75,10],[75,11,75,12],[76,0,76,1],[76,3,76,4],[76,5,76,6],[76,7,76,8],[76,9,76,10],[76,11,76,12],[77,0,77,1],[77,3,77,4],[77,5,77,6],[77,7,77,8],[77,9,77,10],[77,11,77,12],[78,0,78,1],[78,3,78,4],[78,5,78,6],[78,7,78,8],[78,9,78,10],[78,11,78,12],[82,0,82,12],[83,0,83,2],[83,3,83,5],[83,6,83,8],[83,9,83,10],[83,11,83,12],[84,0,85,2],[84,3,84,5],[84,6,84,8],[84,9,85,10],[84,11,84,12],[85,3,85,5],[85,6,85,8],[85,11,85,12],[86,0,86,2],[86,3,86,5],[86,6,86,8],[86,9,86,10],[86,11,86,12],[87,0,87,2],[87,3,87,5],[87,6,87,8],[87,9,87,10],[87,11,87,12],[88,0,88,2],[88,3,88,5],[88,6,88,8],[88,9,88,10],[88,11,88,12],[93,1,94,10],[95,1,99,1],[95,2,95,4],[95,5,95,7],[95,8,95,10],[96,2,96,4],[96,5,96,7],[96,8,96,10],[97,4,98,4],[97,7,98,7],[97,10,98,10],[100,1,100,10],[101,1,101,10]]}
["Worksheet 1A -- General Information and Input Data for Rural Two-Lane Two-Way Roadway Segments",{"$nulls":14},"User Work Space"]
[{"$nulls":37},"Tables Affiliated with Crash Modification Factors:"]
["General Information",{"$nulls":5},"Location Information",{"$nulls":17},"Supplemental CMF Calculations for Shoulders:"]
["Analyst",null,{"$f":"'Project Information'!$B$6","v":"John Smith"},{"$nulls":3},"Roadway",null,null,{"$f":"VLOOKUP('Segment Template'!$C$7,'Project Information'!$A$16:$H$103,2,FALSE)","v":{"$error":"#N/A"}}]
["Agency or Company",null,{"$f":"'Project Information'!$B$7","v":"ABC Company"},{"$nulls":3},"Roadway Section",null,null,{"$f":"VLOOKUP('Segment Template'!$C$7,'Project Information'!$A$16:$H$103,3,FALSE)","v":{"$error":"#N/A"}},{"$nulls":27},"Table 10-8: CMF for Lane Width on Roadway Segments (CMFra)"]
["Date Performed",null,{"$f":"'Project Information'!$F$5","v":"2011-05-12"},{"$nulls":3},"Jurisdiction",null,null,{"$f":"VLOOKUP('Segment Template'!$C$7,'Project Information'!$A$16:$H$103,4,FALSE)","v":{"$error":"#N/A"}},{"$nulls":14},"Calculated Right Shoulder Width (CMFwra) :",{"$nulls":3},{"$f":"IF($G$10>2000,(VLOOKUP($H$12,$AL$25:$AP$33,5,FALSE)),IF($G$10<400,(VLOOKUP($H$12,$AL$25:$AP$33,3,FALSE)),(VLOOKUP($H$12,$AL$25:$AP$33,4))))","v":{"v":1.1,"d":"1.10"}},null,"Calculated Left Shoulder Width (CMFwra) :",{"$nulls":3},{"$f":"IF($G$10>2000,(VLOOKUP($J$12,$AL$25:$AP$33,5,FALSE)),IF($G$10<400,(VLOOKUP($J$12,$AL$25:$AP$33,3,FALSE)),(VLOOKUP($J$12,$AL$25:$AP$33,4))))","v":{"v":1.1,"d":"1.10"}}]
["Segment for Analysis",null,"Segment 1",{"$nulls":3},"Analysis Year",null,null,{"$f":"'Project Information'!$F$6","v":2011},{"$nulls":27},"Lane Width (ft)",null,"AADT (veh/day)"]
["Input Data",{"$nulls":5},"Site Conditions",{"$nulls":3},"Base Conditions",{"$nulls":13},"Calculated Right Shoulder Type (CMF tra) :",{"$nulls":3},{"$f":"IF($H$13=\"Paved\",(HLOOKUP($H$12,'Segment Tables'!$S$8:$AA$12,2,FALSE)),(IF($H$13=\"Gravel\",(HLOOKUP($H$12,'Segment Tables'!$S$8:$AA$12,3,FALSE)),(IF($H$13=\"Turf\",(HLOOKUP($H$12,'Segment Tables'!$S$8:$AA$12,5,FALSE)),HLOOKUP($H$12,'Segment Tables'!$S$8:$AA$12,4,FALSE))))))","v":{"v":1,"d":"1.00"}},null,"Calculated Left Shoulder Type (CMF tra) :",{"$nulls":3},{"$f":"IF($J$13=\"Paved\",(HLOOKUP($J$12,'Segment Tables'!$S$8:$AA$12,2,FALSE)),(IF($J$13=\"Gravel\",(HLOOKUP($J$12,'Segment Tables'!$S$8:$AA$12,3,FALSE)),(IF($J$13=\"Turf\",(HLOOKUP($J$12,'Segment Tables'!$S$8:$AA$12,5,FALSE)),HLOOKUP($J$12,'Segment Tables'!$S$8:$AA$12,4,FALSE))))))","v":{"v":1,"d":"1.00"}},{"$nulls":4},"< 400","400 to 2000","> 2000"]
{"$rows_left_out":95}
{"sheet":"Intersection Template","index":8,"n_rows":87,"n_cols":48,"rows_kept":87,"hidden":true,"merged":[[0,0,1,12],[0,20,0,25],[2,0,2,5],[2,6,2,12],[3,0,3,1],[3,2,3,5],[3,6,3,8],[3,9,3,12],[4,0,4,1],[4,2,4,5],[4,6,4,8],[4,9,4,12],[5,0,5,1],[5,2,5,5],[5,6,5,8],[5,9,5,12],[6,0,6,1],[6,2,6,5],[6,6,6,8],[6,9,6,12],[7,0,7,1],[7,2,7,5],[7,6,7,8],[7,9,7,12],[8,0,8,5],[8,6,8,9],[8,10,8,12],[9,0,9,5],[9,6,9,9],[9,10,9,12],[10,0,10,2],[10,6,10,9],[10,10,10,12],[11,0,11,2],[11,6,11,9],[11,10,11,12],[12,10,12,12],[13,0,13,5],[13,6,13,9],[13,10,13,12],[14,0,14,5],[14,6,14,9],[14,10,14,12],[15,0,15,5],[15,6,15,9],[15,10,15,12],[16,0,16,5],[16,6,16,9],[16,10,16,12],[17,0,17,10],[17,13,22,13],[18,0,19,5],[18,9,18,10],[19,9,19,10],[23,0,23,12],[24,0,24,2],[24,3,24,4],[24,5,24,7],[24,8,24,10],[24,11,24,12],[25,0,25,2],[25,3,25,4],[25,5,25,7],[25,8,25,10],[25,11,25,12],[26,0,26,2],[26,3,26,4],[26,5,26,7],[26,8,26,10],[26,11,26,12],[27,0,27,2],[27,3,27,4],[27,5,27,7],[27,8,27,10],[27,11,27,12],[28,0,28,2],[28,3,28,4],[28,5,28,7],[28,8,28,10],[28,11,28,12],[29,0,29,2],[29,5,29,7],[29,8,29,10],[31,0,31,12],[32,0,32,1],[32,2,32,3],[32,6,32,7],[32,9,32,10],[32,11,32,12],[33,0,36,1],[33,2,34,3],[33,4,34,4],[33,5,34,5],[33,6,34,7],[33,8,34,8],[33,9,36,10],[33,11,34,12],[35,2,36,3],[35,4,36,4],[35,5,36,5],[35,6,36,7],[35,8,36,8],[35,11,36,12],[37,0,37,1],[37,2,37,3],[37,6,37,7],[37,9,37,10],[37,11,37,12],[38,0,38,1],[38,2,38,3],[38,6,38,7],[38,9,38,10],[38,11,38,12],[39,0,39,1],[39,2,39,3],[39,6,39,7],[39,9,39,10],[39,11,39,12],[42,0,42,12],[43,0,43,1],[43,3,43,4],[43,5,43,6],[43,7,43,8],[43,9,43,10],[43,11,43,12],[44,0,48,1],[44,2,46,2],[44,3,46,4],[44,5,46,6],[44,7,46,8],[44,9,46,10],[44,11,46,12],[47,2,48,2],[47,3,48,4],[47,5,48,6],[47,7,48,8],[47,9,48,10],[47,11,48,12],[49,0,49,1],[49,3,49,4],[49,5,49,6],[49,7,49,8],[49,9,49,10],[49,11,49,12],[50,0,50,1],[50,3,50,4],[50,5,50,6],[50,7,50,8],[50,9,50,10],[50,11,50,12],[51,0,51,12],[52,0,52,1],[52,3,52,4],[52,5,52,6],[52,7,52,8],[52,9,52,10],[52,11,52,12],[53,0,53,1],[53,3,53,4],[53,5,53,6],[53,7,53,8],[53,9,53,10],[53,11,53,12],[54,0,54,1],[54,3,54,4],[54,5,54,6],[54,7,54,8],[54,9,54,10],[54,11,54,12],[55,0,55,1],[55,3,55,4],[55,5,55,6],[55,7,55,8],[55,9,55,10],[55,11,55,12],[56,0,56,1],[56,3,56,4],[56,5,56,6],[56,7,56,8],[56,9,56,10],[56,11,56,12],[57,0,57,1],[57,3,57,4],[57,5,57,6],[57,7,57,8],[57,9,57,10],[57,11,57,12],[58,0,58,1],[58,3,58,4],[58,5,58,6],[58,7,58,8],[58,9,58,10],[58,11,58,12],[59,0,59,12],[60,0,60,1],[60,3,60,4],[60,5,60,6],[60,7,60,8],[60,9,60,10],[60,11,60,12],[61,0,61,1],[61,3,61,4],[61,5,61,6],[61,7,61,8],[61,9,61,10],[61,11,61,12],[62,0,62,1],[62,3,62,4],[62,5,62,6],[62,7,62,8],[62,9,62,10],[62,11,62,12],[63,0,63,1],[63,3,63,4],[63,5,63,6],[63,7,63,8],[63,9,63,10],[63,11,63,12],[64,0,64,1],[64,3,64,4],[64,5,64,6],[64,7,64,8],[64,9,64,10],[64,11,64,12],[65,0,65,1],[65,3,65,4],[65,5,65,6],[65,7,65,8],[65,9,65,10],[65,11,65,12],[68,0,68,12],[69,0,69,3],[69,4,69,7],[69,8,69,12],[70,0,71,3],[70,4,70,7],[70,8,70,12],[71,4,71,7],[71,8,71,12],[72,0,72,3],[72,4,72,7],[72,8,72,12],[73,0,73,3],[73,4,73,7],[73,8,73,12],[74,0,74,3],[74,4,74,7],[74,8,74,12],[78,2,79,11],[80,2,84,2],[80,3,80,5],[80,6,80,8],[80,9,80,11],[81,3,81,5],[81,6,81,8],[81,9,81,11],[82,5,83,5],[82,8,83,8],[82,11,83,11],[85,2,85,11],[86,2,86,11]]}
["Worksheet 2A -- General Information and Input Data for Rural Two-Lane Two-Way Roadway Intersections",{"$nulls":19},"User Work Space"]
[]
["General Information",{"$nulls":5},"Location Information"]
["Analyst",null,{"$f":"'Project Information'!$B$6","v":"John Smith"},{"$nulls":3},"Roadway",null,null,{"$f":"VLOOKUP($C$7,'Project Information'!$A$17:$H$103,2,FALSE)","v":{"$error":"#N/A"}}]
["Agency or Company",null,{"$f":"'Project Information'!$B$7","v":"ABC Company"},{"$nulls":3},"Intersection",null,null,{"$f":"VLOOKUP($C$7,'Project Information'!$A$17:$H$103,3,FALSE)","v":{"$error":"#N/A"}}]
["Date Performed",null,{"$f":"'Project Information'!$F$5","v":"2011-05-12"},{"$nulls":3},"Jurisdiction",null,null,{"$f":"VLOOKUP($C$7,'Project Information'!$A$17:$H$103,4,FALSE)","v":{"$error":"#N/A"}}]
["Intersection",null,"Intersection 1",{"$nulls":3},"Analysis Year",null,null,{"$f":"'Project Information'!$F$6","v":2011}]
["Signalized/Unsignalized",null,{"$f":"VLOOKUP($C$7,'Project Information'!$A$17:$H$103,6,FALSE)","v":{"$error":"#N/A"}}]
{"$rows_left_out":80}
{"sheet":"Segment Tables","index":9,"n_rows":50,"n_cols":27,"rows_kept":50,"hidden":true,"merged":[[4,1,5,9],[4,17,5,26],[6,1,6,3],[6,4,6,9],[6,17,7,17],[6,18,6,26],[7,1,7,2],[7,4,7,6],[7,7,7,9],[8,1,8,3],[8,4,8,6],[8,7,8,9],[9,1,9,3],[9,4,9,6],[9,7,9,9],[10,1,10,3],[10,4,10,6],[10,7,10,9],[11,1,11,3],[11,4,11,6],[11,7,11,9],[12,1,12,3],[12,4,12,6],[12,7,12,9],[12,17,13,26],[13,1,13,3],[13,4,13,6],[13,7,13,9],[14,1,14,3],[14,4,14,6],[14,7,14,9],[17,1,18,11],[19,4,19,11],[20,4,20,7],[20,8,20,11],[21,4,22,4],[21,5,22,5],[21,6,22,7],[21,8,22,8],[21,9,22,9],[21,10,22,11],[22,1,22,2],[23,6,23,7],[23,10,23,11],[24,6,24,7],[24,10,24,11],[25,6,25,7],[25,10,25,11],[26,6,26,7],[26,10,26,11],[27,6,27,7],[27,10,27,11],[28,6,28,7],[28,10,28,11],[29,6,29,7],[29,10,29,11],[30,6,30,7],[30,10,30,11],[31,6,31,7],[31,10,31,11],[32,6,32,7],[32,10,32,11],[33,6,33,7],[33,10,33,11],[34,6,34,7],[34,10,34,11],[35,6,35,7],[35,10,35,11],[36,6,36,7],[36,10,36,11],[37,6,37,7],[37,10,37,11],[38,6,38,7],[38,10,38,11],[42,1,42,13],[43,1,47,1],[43,2,43,7],[43,8,43,13],[44,2,44,3],[44,5,46,7],[44,8,46,10],[44,11,46,13],[45,2,46,4],[47,2,47,3],[47,5,47,7],[47,8,47,9],[47,11,47,13],[48,2,48,3],[48,5,48,7],[48,8,48,9],[48,11,48,13]]}
[]
[null,"Tables Affiliated with Crash Statistics:",{"$nulls":15},"Tables Affiliated with Crash Modification Factors:"]
[]
[]
[null,"Table 10-3: Distribution for Crash Severity Level on Rural Two-Lane Two-Way Roadway Segments plus Locally-Derived Values",{"$nulls":15},"Table 10-10: Crash Modification Factors for Shoulder Types and Shoulder Widths on Roadway Segments (CMFtra)"]
[]
[null,"Crash severity level",null,null,"Percentage of total roadway segment crashes",{"$nulls":12},"Shoulder Type","Shoulder width (ft)"]
[null,"Locally-Derived Values?",null,"No","HSM-Provided Values",null,null,"Locally-Derived Values (Oregon)",{"$nulls":10},0,1,2,3,4,5,6,7,8]
{"$rows_left_out":43}
{"sheet":"Intersection Tables","index":10,"n_rows":53,"n_cols":32,"rows_kept":53,"hidden":true,"merged":[[4,1,5,15],[4,24,5,31],[6,1,8,3],[6,4,6,15],[6,24,9,25],[6,26,9,27],[6,28,7,31],[7,4,7,9],[7,10,7,15],[8,4,9,5],[8,6,9,7],[8,8,9,9],[8,10,9,11],[8,12,9,13],[8,14,9,15],[8,28,9,28],[8,29,9,29],[8,30,9,30],[8,31,9,31],[9,1,9,2],[10,1,10,3],[10,4,10,5],[10,6,10,7],[10,8,10,9],[10,10,10,11],[10,12,10,13],[10,14,10,15],[10,24,11,25],[10,26,11,27],[10,28,11,28],[10,29,11,29],[10,30,11,30],[10,31,11,31],[11,1,11,3],[11,4,11,5],[11,6,11,7],[11,8,11,9],[11,10,11,11],[11,12,11,13],[11,14,11,15],[12,1,12,3],[12,4,12,5],[12,6,12,7],[12,8,12,9],[12,10,12,11],[12,12,12,13],[12,14,12,15],[12,24,14,25],[12,26,13,27],[12,28,13,28],[12,29,13,29],[12,30,13,30],[12,31,13,31],[13,1,13,3],[13,4,13,5],[13,6,13,7],[13,8,13,9],[13,10,13,11],[13,12,13,13],[13,14,13,15],[14,1,14,3],[14,4,14,5],[14,6,14,7],[14,8,14,9],[14,10,14,11],[14,12,14,13],[14,14,14,15],[14,26,14,27],[15,1,15,3],[15,4,15,5],[15,6,15,7],[15,8,15,9],[15,10,15,11],[15,12,15,13],[15,14,15,15],[15,25,16,31],[16,1,16,3],[16,4,16,5],[16,6,16,7],[16,8,16,9],[16,10,16,11],[16,12,16,13],[16,14,16,15],[17,1,17,3],[17,4,17,5],[17,6,17,7],[17,8,17,9],[17,10,17,11],[17,12,17,13],[17,14,17,15],[20,1,21,21],[20,24,21,31],[22,1,25,3],[22,4,22,12],[22,13,22,21],[22,24,25,25],[22,26,25,27],[22,28,23,31],[23,4,24,6],[23,7,24,9],[23,10,24,12],[23,13,24,15],[23,16,24,18],[23,19,24,21],[24,28,25,28],[24,29,25,29],[24,30,25,30],[24,31,25,31],[25,4,26,4],[25,5,26,5],[25,6,26,6],[25,7,26,7],[25,8,26,8],[25,9,26,9],[25,10,26,10],[25,11,26,11],[25,12,26,12],[25,13,26,13],[25,14,26,14],[25,15,26,15],[25,16,26,16],[25,17,26,17],[25,18,26,18],[25,19,26,19],[25,20,26,20],[25,21,26,21],[26,1,26,2],[26,24,27,25],[26,26,27,27],[26,28,27,28],[26,29,27,29],[26,30,27,30],[26,31,27,31],[27,1,27,12],[27,13,27,21],[28,1,28,3],[28,24,30,25],[28,26,29,27],[28,28,29,28],[28,29,29,29],[28,30,29,30],[28,31,29,31],[29,1,29,3],[30,1,30,3],[30,26,30,27],[31,1,31,3],[31,25,32,31],[32,1,32,3],[33,1,33,3],[34,1,34,3],[35,1,35,12],[35,13,35,21],[36,1,36,3],[37,1,37,3],[38,1,38,3],[39,1,39,3],[40,1,40,3],[41,1,41,3],[42,1,42,3],[45,1,46,7],[47,1,47,3],[47,4,47,7],[48,1,48,2],[49,1,49,3],[49,4,49,5],[49,6,49,7],[50,1,50,3],[50,4,50,5],[50,6,50,7],[51,1,51,3],[51,4,51,5],[51,6,51,7]]}
[]
[null,"Tables Affiliated with Crash Statistics:",{"$nulls":22},"Tables Affiliated with Crash Modification Factors:"]
[]
[]
[null,"Table 10-5: Default Distribution for Crash Severity Level at Rural Two-Lane Two-Way Intersections plus Locally-Derived Values",{"$nulls":22},"Table 10-13: CMF for Installation of Left-Turn Lanes on Intersection Approaches (CMF2i)"]
[]
[null,"Collision type",null,null,"Percentage of total crashes",{"$nulls":19},"Intersection type",null,"Intersection traffic control",null,"Number of approaches with left-turn lanes a"]
[{"$nulls":4},"HSM-Provided Values",{"$nulls":5},"Locally-Derived Values"]
{"$rows_left_out":46}
{"sheet":"Construction - Do Not Delete","index":11,"n_rows":47,"n_cols":12,"rows_kept":47,"hidden":true}
[]
[]
[null,"Lane Width",null,"Shoulder Width",null,"RHR"]
[null,9,null,0,null,1]
[null,9.5,null,1,null,2]
[null,10,null,2,null,3]
[null,10.5,null,3,null,4]
[null,11,null,4,null,5]
{"$rows_left_out":39}